{"text_format":"1","workbook":"xlsx","n_sheets":7,"sheets":["SMI Analyse KGV","Sicherheitsmarge nach Graham","Analysemöglichkeiten","Daten","Tabelle1","Währungskurse","alte Firmen"],"not_rendered":{"charts":0,"images":0,"macros":1,"external_links":0,"defined_names":0,"comments":1,"pivot_tables":0},"unopened":[],"bounds":{"document_bytes":16777216,"sheet_cells":100000,"rows_first":2000,"rows_last":500,"rows_between":2000,"halvings":0,"cell_chars":16384,"cell_head_chars":4096},"cells_cut":0,"cells_raw":0,"read":"whole","date_system":"1900"}

{"sheet":"SMI Analyse KGV","index":0,"n_rows":168,"n_cols":92,"rows_kept":168,"cut":false,"hidden":false,"merged":[[8,13,8,22],[57,4,57,9],[57,10,57,19]]}
[null,null,null,null,null,null,null,null,null,null,null,null,null,null,null,null,null,null,null,null,null,null,null,null,null,null,null,null,null,null,null,null,null,null,null,null,null,null,null,null,null,null,null,null,null,null,null,null,null,null,null,null,null,18]
[]
["Financial Analysis SMI/SMIM et al.",null,null,"per",null,null,null,null,null,null,null,null,{"$f":"Daten!H3","v":20250425},{"$f":"Daten!H3","v":20250425},{"$f":"Daten!H3","v":20250425},null,null,null,null,null,null,"Kolonnen E - L einblenden für weitere Gewinndaten!"]
[]
[null,null," ",{"$f":"C5","v":" "},null,null,null,null,null,null,null,null,null,null,null,null,"KGV 2023  gewichtet SMI",{"$f":"BW55/CA55","v":26.9646964536948},{"$f":"R5","v":26.9646964536948}," ",null,null,"letzter ausgewiesener Jahresabschluss",null,null,null,null,null,null,null,null,null,null,null,null,null,{"$f":"$AQ$2","v":0},"Bewertung günstig"]
[null,"KGV Ø Gewinn 10 Jahre gewichtet SMI",{"$f":"BW55/BX55","v":29.9789111769871},{"$f":"C6","v":29.9789111769871},null,null,null,null,null,null,null,null,null,null,null,null,"KGV 2024 gewichtet SMI",{"$f":"BW55/BY55","v":25.1131166772181},{"$f":"R6","v":25.1131166772181}," ",null,null,"Schätzung",null,null,null,null,null,null,null,null,null,null,null,null,null,{"$f":"$BB$1","v":18},"Bewertung teuer",null,null,null,null,null,null,null,null,null,null,null,null,null,null,null,null,null,"Abschlusses"]
[null,"KGV Ø Gewinn 10 Jahre gewichtet SMIM",{"$f":"BW150/BX150","v":54.0527033516419},{"$f":"C7","v":54.0527033516419},null,null,null,null,null,null,null,null,null,null,null,null,"KGV 2024 gewichtet SMIM",{"$f":"BW150/BY150","v":39.4798373322081},{"$f":"R7","v":39.4798373322081}]
[null,null,null,null,null,null," "]
[null,null,null,"Ø Gewinn",null,null,"Gewinn pro Aktie",null,null,null,null,null,null,"Gewinn pro Aktie",null,null,null,null,null,null,null,null,null,null,"akt. Kurs",null,"akt. Kurs",null,"KGV 2005",null,"KGV 2006",null,"KGV 2007",null,"KGV 2008",null,null,null,null,null,null,null,null,null,null,null,null," ",null," ",null,"KGV 2016",null,"KGV 2015",null,"KGV 2014",null,"KGV 2012",null,"KGV 2011",null,"KGV 2010",null,null,"KGV 2009",null,"Ø Gewinn",null,"Ø Gewinnverän-",null,"Gewinn-",null,null,"Gewichtung","gewichteter","gewichteter","gewichteter","gewichteter","gewichteter","gewichtetes","gewichtetes","gewichtetes","gewichtetes","gewichtetes","gewichtetes","gewichtetes","gewichtetes","gewichtetes","gewichtetes","gewichtetes",null,"Gewichtung"]
[" ",null,null,"2015 – 2024",2005,2006,2007,2008,2009,2010,2011,2012,2013,2014,2015,2016,2017,2018,2019,2020,2021,2022,2023,2024,null,null,"in RW",null,null,null,null,null,null,null,null,"KGV2024",null,"KGV2023",null,"KGV2022",null,"KGV2021",null,"KGV2020",null,"KGV2019",null,"KGV2018",null,"KGV2017",null,null,null,null,null,null,null,null,null,null,null,null,null,null,null,null,"15-24 KGV",null,"derungsraten 10J",null,"wachstum 10 J",null,null,"per 24.01.25","Preis","Gewinn 15-24","Gewinn 2024","Gewinn 2023","Gewinn 2022","KGV2021","KGV2020","KGV2019","KGV2018","KGV2017","KGV2016","KGV2015","KGV2014","KGV12","KGV11","KGV10",null,"per 16.3.10"]
[null,null,null,null,null,null,null,null,null,null,null,null,null,null,null,null,null,null,null,null,null,null,null,null,null,null,null,null,null,null,null,null,null,null,null,null,null,null,null,null,null,null,null,null,null,null,null,null,null,null,null,null,null,null,null,null,null,null,null,null,null,null,null,null,null,null,null,null,null,null,null,null,null,"gem. boerse.de"]
[]
["SMI Titel"]
[]
["USD","ABB LTD N","ABBN",{"$f":"SUM(O15:X15)/10","v":1.463},0.36,0.63,1.63,1.36,1.27,1.12,1.38,1.18,1.21,1.13,0.87,0.88,1.04,1.02,0.67,2.44,2.27,1.3,2.01,2.13,{"$f":"LOOKUP(C15,Daten!$C$2:$C$300,Daten!$E$2:$E$500)","v":43.25},null,{"$f":"Y15/Währungskurse!C$4","v":52.7439024390244},null,{"$f":"AA15/E15","v":146.510840108401},null,{"$f":"AA15/F15","v":83.7204800619435},null,{"$f":"AA15/G15","v":32.3582223552297},null,{"$f":"AA15/H15","v":38.782281205165},{"$f":"AA15/X15","v":24.7623955112791},{"$f":"AJ15","v":24.7623955112791},{"$f":"AA15/W15","v":26.2407474821017},{"$f":"AL15","v":26.2407474821017},{"$f":"AA15/V15","v":40.5722326454034},{"$f":"AN15","v":40.5722326454034},{"$f":"AA15/U15","v":23.2351993123455},{"$f":"AP15","v":23.2351993123455},{"$f":"AA15/T15","v":21.6163534586166},{"$f":"AR15","v":21.6163534586166},{"$f":"AA15/S15","v":78.7222424463051},{"$f":"AT15","v":78.7222424463051},{"$f":"AA15/R15","v":51.7097082735533},{"$f":"AV15","v":51.7097082735533},{"$f":"AA15/Q15","v":50.7152908067542},{"$f":"AX15","v":50.7152908067542},{"$f":"AA15/P15","v":59.9362527716186},{"$f":"AZ15","v":59.9362527716186},{"$f":"AA15/O15","v":60.6251752172694},{"$f":"BB15","v":60.6251752172694},{"$f":"AA15/N15","v":46.6760198575437},{"$f":"BD15","v":46.6760198575437},{"$f":"AA15/L15","v":44.6982224059529},{"$f":"BF15","v":44.6982224059529},{"$f":"AA15/K15","v":38.2202191587133},{"$f":"BH15","v":38.2202191587133},{"$f":"AA15/J15","v":47.0927700348432},{"$f":"BJ15","v":47.0927700348432},null,{"$f":"AA15/I15","v":41.5306318417515},{"$f":"BM15","v":41.5306318417515},{"$f":"AA15/D15","v":36.0518813663871},{"$f":"BO15","v":36.0518813663871},{"$f":"Tabelle1!O13","v":0.235151739197314},{"$f":"IF(BQ15>0,BQ15,10)","v":0.235151739197314},{"$f":"IF(X15>O15,(X15-O15)/O15,-(O15-X15)/O15)","v":1.44827586206897},{"$f":"BS15","v":1.44827586206897},null,7.49,{"$f":"BV15/100*AA15","v":3.95051829268293},{"$f":"D15*(BV15/100)","v":0.1095787},{"$f":"X15*(BV15/100)","v":0.159537},{"$f":"W15*(BV15/100)","v":0.150549},{"$f":"V15*(BV15/100)","v":0.09737},{"$f":"AP15*BV15","v":174.031642849468},{"$f":"AR15*BV15","v":161.906487405038},{"$f":"AT15*BV15","v":589.629595922825},{"$f":"AV15*BV15","v":387.305714968914},{"$f":"AX15*BV15","v":379.857528142589},{"$f":"AZ15*BV15","v":448.922533259424},{"$f":"BB15*BV15","v":454.082562377348},{"$f":"BD15*BV15","v":349.603388733002},{"$f":"BF15*BV15","v":334.789685820587},{"$f":"BH15*BV15","v":286.269441498763},{"$f":"BJ15*BV15","v":352.724847560976},null,6.09]
{"$rows_left_out":154}
{"sheet":"Sicherheitsmarge nach Graham","index":1,"n_rows":148,"n_cols":34,"rows_kept":148,"cut":false,"hidden":false,"merged":[[7,10,7,19],[66,2,66,5],[68,2,68,6],[70,2,70,6],[76,2,76,7],[78,2,78,7],[80,2,80,7],[82,2,82,7],[86,2,86,7],[88,2,88,6],[90,2,90,6],[92,2,92,6],[94,2,94,6],[96,2,96,7]]}
[]
[]
[null,"Sicherheitsmarge nach Graham"]
[]
[null,"Umlaufrenditen der Obligationen im Schnitt in %",null,null,null,null,0,null,{"$f":"K5","v":0},0,0,1.1,1.1,0.5]
[null,"Sicherheitsmarge muss grösser als 5%-Punkte sein"]
[]
[null,null,null,null,null,null,null,"Gewinn pro Aktie"," ",null,"Gewinn pro Aktie",null,null,null,null,null,null,null,null,null,null,null,null,null,"akt. Kurs",null,"akt. Kurs ",null,"Ø Gewinn",null,"Gewinn-",null,"Sicherheitsmarge"]
[null,"SMI Titel",null,null,2005,2006,2007,2008,2009,2010,2011,2012,2013,2014,2015,2016,2017,2018,2019,2020,2021,2022,2023,2024,null,null,"in RW",null,"2015-2024",null,"rendite",null,">=5% Punkte"]
[]
[]
[null,"USD","ABB LTD N","ABBN",{"$f":"'SMI Analyse KGV'!E15","v":0.36},{"$f":"'SMI Analyse KGV'!F15","v":0.63},{"$f":"'SMI Analyse KGV'!G15","v":1.63},{"$f":"'SMI Analyse KGV'!H15","v":1.36},{"$f":"'SMI Analyse KGV'!I15","v":1.27},{"$f":"'SMI Analyse KGV'!J15","v":1.12},{"$f":"'SMI Analyse KGV'!K15","v":1.38},{"$f":"'SMI Analyse KGV'!L15","v":1.18},{"$f":"'SMI Analyse KGV'!M15","v":1.21},{"$f":"'SMI Analyse KGV'!N15","v":1.13},{"$f":"'SMI Analyse KGV'!O15","v":0.87},{"$f":"'SMI Analyse KGV'!P15","v":0.88},{"$f":"'SMI Analyse KGV'!Q15","v":1.04},{"$f":"'SMI Analyse KGV'!R15","v":1.02},{"$f":"'SMI Analyse KGV'!S15","v":0.67},{"$f":"'SMI Analyse KGV'!T15","v":2.44},{"$f":"'SMI Analyse KGV'!U15","v":2.27},{"$f":"'SMI Analyse KGV'!V15","v":1.3},{"$f":"'SMI Analyse KGV'!W15","v":2.01},{"$f":"'SMI Analyse KGV'!X15","v":2.13},{"$f":"LOOKUP(D12,Daten!$C$2:$C$300,Daten!$E$2:$E$500)","v":43.25},null,{"$f":"Y12/Währungskurse!C$4","v":52.7439024390244},null,{"$f":"'SMI Analyse KGV'!D15","v":1.463},null,{"$f":"AC12/AA12*100","v":2.77378034682081},null,{"$f":"AE12-$N$5","v":2.27378034682081},{"$f":"AG12","v":2.27378034682081}]
[null,null," "," "]
[null,"USD","ALCON N","ALC",null,null,null,null,null,null,null,null,null,null,null,null,{"$f":"'SMI Analyse KGV'!Q17","v":0.52},{"$f":"'SMI Analyse KGV'!R17","v":-0.46},{"$f":"'SMI Analyse KGV'!S17","v":-1.34},{"$f":"'SMI Analyse KGV'!T17","v":-1.09},{"$f":"'SMI Analyse KGV'!U17","v":0.76},{"$f":"'SMI Analyse KGV'!V17","v":0.68},{"$f":"'SMI Analyse KGV'!W17","v":1.96},{"$f":"'SMI Analyse KGV'!X17","v":2.05},{"$f":"LOOKUP(D14,Daten!$C$2:$C$300,Daten!$E$2:$E$500)","v":78.52},null,{"$f":"Y14/Währungskurse!C$5","v":85.3478260869565},null,{"$f":"'SMI Analyse KGV'!D17","v":0.385},null,{"$f":"AC14/AA14*100","v":0.451095262353541},null,{"$f":"AE14-$N$5","v":-0.0489047376464595},{"$f":"AG14","v":-0.0489047376464595}]
[]
{"$rows_left_out":134}
{"sheet":"Analysemöglichkeiten","index":2,"n_rows":17,"n_cols":2,"rows_kept":17,"cut":false,"hidden":false,"merged":[]}
[]
[]
[]
[]
[]
[]
[]
[]
[null,"Analysemöglichkeiten"]
[]
[null,"1. Suchen Sie nach Firmen, deren KGV (= Kurs-Gewinn Verhältnis) unter 16 liegt (Ticker grün). Entweder neuestes KGV oder, etwas konservativer, KGV des durchschnittlichen Gewinnes über 10 Jahre."]
[]
[null,"2. Alternativ suchen Sie nach Firmen, deren Sicherheitsmarge grösser als 5% Punkte ist (Ticker grün)."]
[]
[null,"3. Untersuchen Sie bei diesen Firmen, ob Sie eine über 10 Jahre insgesamt eine Gewinnsteigerung von über 160 % ausweisen."]
{"$rows_left_out":3}
{"sheet":"Daten","index":3,"n_rows":258,"n_cols":26,"rows_kept":258,"cut":false,"hidden":false,"merged":[]}
["ShortName","ISIN","ValorSymbol","ValorNumber","ClosingPrice","DailyHighPrice","DailyLowPrice","LatestTradeDate","PreviousClosingPrice","OpeningPrice","OnMarketVolume","OffBookVolume","SwissAtMidVolume","TotalVolume","TradingBaseCurrency","YearlyHighDate","YearlyHighPrice","YearlyLowDate","YearlyLowPrice","FirstTradingDate","LastTradingDate","Exchange","SecTypeCode","GeographicalAreaCode","Tminus1Volume","VWAP60Price"]
["ANGLO PLC","GB00B1XZS820","AAM",3186826,21.2,null,null,20250416,21.2,null,0,0,0,0,"CHF",20240513,31.2,20250416,21.2,20070703,null,"XSWX","RS","GB",0,21.33]
["ABB LTD N","CH0012221716","ABBN",1222171,43.25,43.47,42.81,20250425,42.31,43.15,2681634,141000,226339,3048973,"CHF",20250124,54,20250407,37.25,20201207,null,"XSWX","RS","CH",0,46.71]
["ABB LTD N 2. LINIE","CH0357679619","ABBNE",35767961,43.37,43.37,42.88,20250425,42.29,43.34,122328,0,0,122328,"CHF",20250124,54.06,20250407,37.35,20250210,20260128,"XSWX","RS","CH",0,46.53]
["ABBOTT LABOR","US0028241000","ABT",903037,106,null,null,20250408,106,null,0,0,0,0,"CHF",20250408,104,20240815,92,19951208,null,"XSWX","RS","US",0,104]
["ACCELLERON N","CH1169360919","ACLN",116936091,42.9,43.26,41.92,20250425,41.9,42.1,216005,0,21078,237083,"CHF",20241111,51.6,20250407,30,20221003,null,"XSWX","RS","CH",0,41.71]
["ADECCO N","CH0012138605","ADEN",1213860,21.68,22.26,21.52,20250425,21.74,21.9,575623,94500,40266,710389,"CHF",20240516,36.62,20250409,19.67,20201207,null,"XSWX","RS","CH",0,24.27]
["ADVAL TECH N","CH0008967926","ADVN",896792,55.5,null,null,20250424,55.5,null,0,0,0,0,"CHF",20240709,100,20250423,53,19980604,null,"XSWX","RS","CH",0,64.01]
["ADDEX N","CH0029850754","ADXN",2985075,0.0574,0.0574,0.0514,20250425,0.0504,0.0558,429334,0,0,429334,"CHF",20241022,0.1095,20250409,0.0472,20070522,null,"XSWX","RS","CH",0,0.06]
["MONTANA N","CH1110425654","AERO",111042565,15.08,15.16,14.8,20250425,14.8,14.92,19017,0,4441,23458,"CHF",20240926,21.45,20250409,13.3,20210512,null,"XSWX","RS","CH",0,16.43]
["AEVIS N","CH0478634105","AEVS",47863410,13.55,13.6,13.4,20250425,13.3,13.5,871,0,0,871,"CHF",20240703,16.5,20250403,11.75,20190607,null,"XSWX","RS","CH",0,13.21]
["ALUFLEXPACK N","CH0453226893","AFP",45322689,15.65,null,null,20250424,15.65,null,0,0,0,0,"CHF",20250220,16.05,20240805,14.15,20190628,null,"XSWX","RS","CH",0,15.81]
["AIRESIS N","CH0010947627","AIRE",1094762,0.0845,null,null,20250423,0.0845,null,0,0,0,0,"CHF",20240510,0.52,20241205,0.04,20000717,null,"XSWX","RS","CH",0,0.09]
["ALCON N","CH0432492467","ALC",43249246,78.52,79.2,78.24,20250425,77.6,78.44,583908,21200,28529,633637,"CHF",20250226,87,20250407,67.34,20201207,null,"XSWX","RS","CH",0,79.12]
["ALLREAL N","CH0008837566","ALLN",883756,184,185.4,183.2,20250425,185.2,184.6,35639,0,13110,48749,"CHF",20250422,186.2,20240429,147.8,20000303,null,"XSWX","RS","CH",0,176.38]
{"$rows_left_out":244}
{"sheet":"Tabelle1","index":4,"n_rows":149,"n_cols":15,"rows_kept":149,"cut":false,"hidden":false,"merged":[[61,2,61,11]]}
[null,null,"VERÄNDERUNGSRATEN",null,null,null,null,null,null,null,null,null,null,null,"Durchschnittliche Gewinnveränderungsraten"]
[null,null,"2013","2014","2015","2016","2017","2018","2019","2020","2021","2022","2023","2024"]
[]
[]
[]
[]
[]
[]
[]
[]
[]
[]
[null,"ABB LTD N ",{"$f":"('SMI Analyse KGV'!M15-'SMI Analyse KGV'!L15)/ABS('SMI Analyse KGV'!L15)","v":0.0254237288135593},{"$f":"('SMI Analyse KGV'!N15-'SMI Analyse KGV'!M15)/ABS('SMI Analyse KGV'!M15)","v":-0.0661157024793389},{"$f":"('SMI Analyse KGV'!O15-'SMI Analyse KGV'!N15)/ABS('SMI Analyse KGV'!N15)","v":-0.230088495575221},{"$f":"('SMI Analyse KGV'!P15-'SMI Analyse KGV'!O15)/ABS('SMI Analyse KGV'!O15)","v":0.0114942528735632},{"$f":"('SMI Analyse KGV'!Q15-'SMI Analyse KGV'!P15)/ABS('SMI Analyse KGV'!P15)","v":0.181818181818182},{"$f":"('SMI Analyse KGV'!R15-'SMI Analyse KGV'!Q15)/ABS('SMI Analyse KGV'!Q15)","v":-0.0192307692307692},{"$f":"('SMI Analyse KGV'!S15-'SMI Analyse KGV'!R15)/ABS('SMI Analyse KGV'!R15)","v":-0.343137254901961},{"$f":"('SMI Analyse KGV'!T15-'SMI Analyse KGV'!S15)/ABS('SMI Analyse KGV'!S15)","v":2.64179104477612},{"$f":"('SMI Analyse KGV'!U15-'SMI Analyse KGV'!T15)/ABS('SMI Analyse KGV'!T15)","v":-0.069672131147541},{"$f":"('SMI Analyse KGV'!V15-'SMI Analyse KGV'!U15)/ABS('SMI Analyse KGV'!U15)","v":-0.427312775330396},{"$f":"('SMI Analyse KGV'!W15-'SMI Analyse KGV'!V15)/ABS('SMI Analyse KGV'!V15)","v":0.546153846153846},{"$f":"('SMI Analyse KGV'!X15-'SMI Analyse KGV'!W15)/ABS('SMI Analyse KGV'!W15)","v":0.0597014925373135},{"$f":"AVERAGE(E13:N13)","v":0.235151739197314}]
[null," "]
[null,"ALCON N 1)"," "," "," "," "," ",{"$f":"('SMI Analyse KGV'!R17-'SMI Analyse KGV'!Q17)/ABS('SMI Analyse KGV'!Q17)","v":-1.88461538461538},{"$f":"('SMI Analyse KGV'!S17-'SMI Analyse KGV'!R17)/ABS('SMI Analyse KGV'!R17)","v":-1.91304347826087},{"$f":"('SMI Analyse KGV'!T17-'SMI Analyse KGV'!S17)/ABS('SMI Analyse KGV'!S17)","v":0.186567164179104},{"$f":"('SMI Analyse KGV'!U17-'SMI Analyse KGV'!T17)/ABS('SMI Analyse KGV'!T17)","v":1.69724770642202},{"$f":"('SMI Analyse KGV'!V17-'SMI Analyse KGV'!U17)/ABS('SMI Analyse KGV'!U17)","v":-0.105263157894737},{"$f":"('SMI Analyse KGV'!W17-'SMI Analyse KGV'!V17)/ABS('SMI Analyse KGV'!V17)","v":1.88235294117647},{"$f":"('SMI Analyse KGV'!X17-'SMI Analyse KGV'!W17)/ABS('SMI Analyse KGV'!W17)","v":0.0459183673469387},{"$f":"AVERAGE(H15:N15)","v":-0.0129765488066364}]
{"$rows_left_out":135}
{"sheet":"Währungskurse","index":5,"n_rows":5,"n_cols":3,"rows_kept":5,"cut":false,"hidden":false,"merged":[]}
[]
[null,"Währungskurse"]
[]
[null,"USD",0.82]
[null,"EUR",0.92]

{"sheet":"alte Firmen","index":6,"n_rows":3,"n_cols":69,"rows_kept":3,"cut":false,"hidden":false,"merged":[]}
[]
[]
[null,"Bobst","BOBNN",{"$f":"SUM(N3:W3)/10","v":4.086},null,null,null,null,null,3,0.03,-0.43,1.59,3.06,3.55,5.08,6.93,3.84,4.12,1.85,5.51,6.92,null,68,null,null,null,null,null,null,null,null,null,null,{"$f":"X3/W3","v":{"$error":"#DIV/0!"}},{"$f":"AI3","v":{"$error":"#DIV/0!"}},{"$f":"X3/V3","v":9.82658959537572},{"$f":"AK3","v":9.82658959537572},{"$f":"X3/U3","v":12.3411978221416},{"$f":"AM3","v":12.3411978221416},{"$f":"X3/T3","v":36.7567567567568},{"$f":"AO3","v":36.7567567567568},{"$f":"X3/S3","v":16.504854368932},{"$f":"AQ3","v":16.504854368932},{"$f":"X3/R3","v":17.7083333333333},{"$f":"AS3","v":17.7083333333333},{"$f":"X3/Q3","v":9.81240981240981},{"$f":"AU3","v":9.81240981240981},null,null,null,null,null,null,null,null,null,null,null,null,null,null,null,{"$f":"X3/D3","v":16.6421928536466},{"$f":"BL3","v":16.6421928536466},{"$f":"#REF!","v":{"$error":"#REF!"}},{"$f":"IF(BN3>0,BN3,10)","v":{"$error":"#REF!"}},{"$f":"IF(W3>N3,(W3-N3)/N3,-(N3-W3)/N3)","v":-1},{"$f":"BP3","v":-1}]